{"text_format":"3","workbook":"xlsx","n_sheets":9,"sheets":["Result summary","Optical power calculation","Distance noise","Illumination selection","Integration time","epc660 frame rate","epc635 frame rate","epc611 frame rate","Support Tables"],"not_rendered":{"charts":1,"defined_names":5,"comments":1},"read":"whole","date_system":"1900"}

{"sheet":"Result summary","index":0,"n_rows":27,"n_cols":5,"rows_kept":27,"merged":[[0,1,0,4],[1,1,1,4],[2,1,2,4],[5,1,5,2],[5,3,5,4],[7,3,8,4],[9,3,10,4],[11,3,11,4],[13,3,13,4],[14,3,14,4],[15,3,15,4],[16,3,16,4],[17,3,17,4],[18,3,18,4],[19,3,19,4],[20,3,20,4],[21,3,21,4],[22,3,22,4],[23,3,23,4],[24,3,24,4],[26,0,26,4],[27,0,33,4]]}
["Customer name","ESPROS"]
["Project name","TOF Estimation Tool"]
["Designer","ESPROS"]
[]
[]
["Parameter","Value",null,"Comments"]
["Operating range",{"$f":"'Optical power calculation'!E22","v":{"v":5,"d":"5.0"}},"m            @",{"$f":"'Optical power calculation'!E23","v":90},"% reflectivity"]
["FOVh",{"$f":"'Optical power calculation'!K20","v":{"v":97.6113149289582,"d":"97.6"}},"°","on image"]
{"$rows_left_out":20}
{"sheet":"Optical power calculation","index":1,"n_rows":65,"n_cols":14,"rows_kept":65,"merged":[[0,0,0,5],[0,7,0,11],[2,0,2,5],[2,7,2,11],[3,0,9,0],[3,1,3,2],[3,3,3,5],[3,7,3,8],[4,1,4,2],[4,7,4,8],[5,1,5,2],[5,7,5,8],[6,1,6,2],[6,7,6,8],[7,1,7,2],[7,7,7,8],[8,1,8,2],[8,7,8,8],[9,1,9,2],[10,0,18,0],[10,1,10,2],[10,7,10,11],[11,1,11,2],[11,7,16,7],[12,1,12,2],[13,1,13,2],[14,1,14,2],[15,1,15,2],[16,1,16,2],[17,1,17,2],[17,7,26,7],[18,1,18,2],[19,13,20,13],[20,0,20,5],[21,0,21,2],[22,0,22,2],[28,0,28,5],[28,7,28,11],[29,0,31,0],[29,1,29,2],[29,7,29,8],[30,1,30,2],[30,7,30,8],[31,1,31,2],[31,7,31,8],[33,0,33,5],[33,7,33,11],[34,0,41,0],[34,1,34,2],[34,3,34,5],[34,7,34,8],[35,1,35,2],[35,7,35,8],[36,1,36,2],[36,7,36,8],[37,1,37,2],[37,7,37,8],[38,1,38,2],[39,1,39,2],[40,1,40,2],[41,1,41,2],[42,0,48,0],[42,1,42,2],[43,1,43,2],[44,1,44,2],[45,1,45,2],[46,1,46,2],[47,1,47,2],[48,1,48,2],[50,0,50,5],[50,7,50,11],[51,0,51,2],[51,7,51,8],[52,0,52,2],[52,7,52,8],[53,0,53,2],[54,0,54,2],[55,0,55,2],[56,0,56,2],[57,0,57,2],[59,0,59,11],[60,0,60,11],[61,0,61,11],[62,0,62,11],[63,0,63,11],[64,0,64,11],[65,0,65,11]]}
["Input Data",{"$nulls":6},"Results"]
[]
["Emitter",{"$nulls":6},"Emitter",{"$nulls":5},"Comments"]
["Datasheet","Type",null,{"$f":"'Illumination selection'!E6","v":"SFH 4725AS A01"},{"$nulls":3},"Total radiant intensity @ iNOM",null,"IE TOT",{"$f":"E7*E15/1000/E8*E14","v":{"v":15.2,"d":"15.20"}},"W/sr"]
[null,"Wavelength",null,"λNOM",{"$f":"'Illumination selection'!G6","v":940},"nm",null,"Focal length for bare die (only square FOV)",null,"fR",{"$f":"IF(AND(E12=E11,E9>0,E13=1),E9/K12*E22,\"---\")","v":"---"},"mm"]
[null,"Emitting half-angle (IE LED = 50%)",null,"φLED",{"$f":"'Illumination selection'!I6","v":40},"± deg",null,"Electrical peak power",null,"PPP",{"$f":"E14*E15*E16/1000","v":{"v":70,"d":"70.00"}},"W"]
[null,"Nominal radiant intensity @ iNOM per LED",null,"IE LED",{"$f":"'Illumination selection'!J6","v":{"v":760,"d":"760.0"}},"mW/sr",null,"Electrical energy per DCS",null,"IE_DCS",{"$f":"K6*K38/2/1000","v":{"v":34.3356825368514,"d":"34.336"}},"mWs",null,"TOF mode (Modulation frequency duty cycle 1:1)"]
[null,"Current for nominal radiant intensity",null,"iNOM",{"$f":"'Illumination selection'!L6","v":{"v":1000,"d":"1,000"}},"mA",null,"Total electrical power consumption",null,"IE_TOT",{"$f":"K7*E17*E18/1000","v":{"v":4.12028190442217,"d":"4.120"}},"W",null,"Average power consumption for the illumination w/o other circuitry"]
{"$rows_left_out":58}
{"sheet":"Distance noise","index":2,"n_rows":30,"n_cols":9,"rows_kept":30,"merged":[[0,0,0,2],[0,4,0,6],[0,8,0,20],[19,0,23,2],[26,4,27,4],[26,5,27,5],[26,6,27,6],[29,4,30,4],[29,5,30,5],[29,6,30,6]]}
["Input Data",{"$nulls":3},"Results",{"$nulls":3},"Distance noise graph"]
[]
["Parameter","Value","Unit",null,"Parameter (only factory set inputs)","Value","Unit"]
["Mod. Freq.",{"v":20,"d":"20.0"},"MHz",null,"Unambiguity range",{"$f":"15*10/B4","v":7.5},"m"]
["Pixel cut-off freq.",{"v":13,"d":"13.0"},"MHz",null,"Demodulation loss",{"$f":"1/SQRT(1+(($B$4/$B$5)*($B$4/$B$5)))","v":{"v":0.544988350595414,"d":"0.5"}},"#"]
["Max. ADC amplitude per basic pixel, no zoom",{"v":2047,"d":"2,047"},"LSB"]
["Max. “photons” for max. ADC amplitude",{"v":200000,"d":"200,000"},"e-",null,"No. of max. TOF amplitude “photons”",{"$f":"$B$7/$B$9*$B$13/$B$6","v":{"v":78163.1656082071,"d":"78,163"}},"Electrons"]
["Ratio of “photons” of max. TOF amplitude to ambient-light",{"v":8,"d":"8.0"},"#",null,"No. of ambient-light “photons” (< 10 Me-)",{"$f":"$B$7/$B$9*$B$8*$B$13/$B$6","v":{"v":625305.324865657,"d":"625,305"}},"Electrons"]
{"$rows_left_out":23}
{"sheet":"Illumination selection","index":3,"n_rows":45,"n_cols":21,"rows_kept":45,"merged":[[2,0,4,0],[2,1,4,1],[2,2,4,2],[2,3,4,3],[2,4,4,4],[2,5,4,5],[2,13,2,14],[2,15,4,15]]}
["Illumination source selection list – main optical data – other data need to be completed according corresponding datasheet"]
[]
["Sel.","No.","Supplier","Type","P/N","Application","Wavelength","Imager irradiance\n for 1 LSB \n@ tNOM","Emitting half-angle\n (IE LED = 50%)","Nominal \nradiant intensity\n @ iNOM per LED","Opt. Power \nDC 5 in \nemitter area","Current\n  for nominal\nradiant intensity","Current\n  maximum,\npulsed operation","Bare die size",null,"FOV: \n1: rect. \n2: round","FOV 3 \nhorizontal \n(round)","FOV 3 \nvertical","Emitter lens \nfocal length","Emitter lens \nlens area","Emitter lens \nefficiency"]
[{"$nulls":6},"φLED","ER-LSB","φLED","IE LED","PEO","iNOM","iMAX_PULSED","bl","bw",null,"FOVH","FOVV","fE","AE","vE"]
[{"$nulls":6},"nm","nW/mm2","± deg","mW/sr","W","mA","mA","mm","mm",null,"deg","deg","mm","mm2","%"]
["Sel.",{"$f":"IF(SUM($A$8:$A$45)=1,OFFSET(B8,SUMPRODUCT($A$8:$A$45,$B$8:$B$45)-1,0,1),IF(SUM($A$8:$A$45)>1,\"More than 1\",\"No selection\"))","v":14},{"$f":"IF(SUM($A$8:$A$45)=1,OFFSET(C8,SUMPRODUCT($A$8:$A$45,$B$8:$B$45)-1,0,1),\"No selection\")","v":"Osram"},{"$f":"IF(SUM($A$8:$A$45)=1,OFFSET(D8,SUMPRODUCT($A$8:$A$45,$B$8:$B$45)-1,0,1),\"No selection\")","v":"LED"},{"$f":"IF(SUM($A$8:$A$45)=1,OFFSET(E8,SUMPRODUCT($A$8:$A$45,$B$8:$B$45)-1,0,1),\"No selection\")","v":"SFH 4725AS A01"},{"$f":"IF(SUM($A$8:$A$45)=1,OFFSET(F8,SUMPRODUCT($A$8:$A$45,$B$8:$B$45)-1,0,1),\"No selection\")","v":0},{"$f":"IF(SUM($A$8:$A$45)=1,OFFSET(G8,SUMPRODUCT($A$8:$A$45,$B$8:$B$45)-1,0,1),\"No selection\")","v":940},{"$f":"IF(SUM($A$8:$A$45)=1,OFFSET(H8,SUMPRODUCT($A$8:$A$45,$B$8:$B$45)-1,0,1),\"No selection\")","v":{"v":0.82,"d":"0.820"}},{"$f":"IF(SUM($A$8:$A$45)=1,OFFSET(I8,SUMPRODUCT($A$8:$A$45,$B$8:$B$45)-1,0,1),\"No selection\")","v":{"v":40,"d":"40.0"}},{"$f":"IF(SUM($A$8:$A$45)=1,OFFSET(J8,SUMPRODUCT($A$8:$A$45,$B$8:$B$45)-1,0,1),\"No selection\")","v":760},{"$f":"IF(SUM($A$8:$A$45)=1,OFFSET(K8,SUMPRODUCT($A$8:$A$45,$B$8:$B$45)-1,0,1),\"No selection\")","v":"---"},{"$f":"IF(SUM($A$8:$A$45)=1,OFFSET(L8,SUMPRODUCT($A$8:$A$45,$B$8:$B$45)-1,0,1),\"No selection\")","v":{"v":1000,"d":"1,000"}},{"$f":"IF(SUM($A$8:$A$45)=1,OFFSET(M8,SUMPRODUCT($A$8:$A$45,$B$8:$B$45)-1,0,1),\"No selection\")","v":{"v":5000,"d":"5,000"}},{"$f":"IF(SUM($A$8:$A$45)=1,OFFSET(N8,SUMPRODUCT($A$8:$A$45,$B$8:$B$45)-1,0,1),\"No selection\")","v":{"v":1.3,"d":"1.300"}},{"$f":"IF(SUM($A$8:$A$45)=1,OFFSET(O8,SUMPRODUCT($A$8:$A$45,$B$8:$B$45)-1,0,1),\"No selection\")","v":{"v":1.3,"d":"1.300"}},{"$f":"IF(SUM($A$8:$A$45)=1,OFFSET(P8,SUMPRODUCT($A$8:$A$45,$B$8:$B$45)-1,0,1),\"No selection\")","v":2},{"$f":"IF(SUM($A$8:$A$45)=1,OFFSET(Q8,SUMPRODUCT($A$8:$A$45,$B$8:$B$45)-1,0,1),\"No selection\")","v":{"v":80,"d":"80.00"}},{"$f":"IF(SUM($A$8:$A$45)=1,OFFSET(R8,SUMPRODUCT($A$8:$A$45,$B$8:$B$45)-1,0,1),\"No selection\")","v":"---"},{"$f":"IF(SUM($A$8:$A$45)=1,OFFSET(S8,SUMPRODUCT($A$8:$A$45,$B$8:$B$45)-1,0,1),\"No selection\")","v":"---"},{"$f":"IF(SUM($A$8:$A$45)=1,OFFSET(T8,SUMPRODUCT($A$8:$A$45,$B$8:$B$45)-1,0,1),\"No selection\")","v":"---"},{"$f":"IF(SUM($A$8:$A$45)=1,OFFSET(U8,SUMPRODUCT($A$8:$A$45,$B$8:$B$45)-1,0,1),\"No selection\")","v":100}]
[]
[null,1,"Osram","LED","SFH 4059-R","---",850,{"v":0.62,"d":"0.620"},{"v":10,"d":"10.0"},100,"---",70,700,"---","---",2,{"$f":"2*I8","v":{"v":20,"d":"20.00"}},"---","---","---",100]
{"$rows_left_out":38}
{"sheet":"Integration time","index":4,"n_rows":17,"n_cols":21,"rows_kept":17,"merged":[[0,0,0,2],[0,4,0,20],[2,8,2,9],[2,10,2,11],[2,12,2,13],[2,15,2,20],[7,0,7,2],[7,4,8,4],[7,5,8,5],[7,6,8,6],[7,15,7,20],[9,4,10,4],[9,15,16,15],[9,16,16,16],[9,17,16,17],[11,20,16,20],[13,19,16,19]]}
["Input Data",{"$nulls":3},"Results"]
[]
["Parameter","Unit","Value",null,"Parameter","Unit","Value",null,"Register use",null,"Final integration time",null,"Register values",null,null,"in operating mode:"]
["Mod. Freq.","MHz",{"$f":"'Distance noise'!B4","v":{"v":20,"d":"20.0"}},null,"mod_clk","MHz",{"$f":"C4*4","v":{"v":80,"d":"80.0"}},null,"Multiplier int. time","#",null,null,"Dec","Hex",null,"epc660 mgx0","epc660 mgx1","epc611 others","epc611 U-HDR","epc611 H-HDR","epc611 MBR HDR"]
[{"$nulls":4},"mod_clk period","ns",{"$f":"1/G4*1000","v":12.5},null,"Register address",{"$nulls":6},"0xA0 / 0xA1","0xA0 / 0xA1","0xA0 / 0xA1","0xA0 / 0xA1","0xA0 / 0xA1","0xA0 / 0xA1"]
[{"$nulls":4},"Unambiguity","m",{"$f":"15*10/C4","v":7.5},null,"Repetitions INTM_",{"$f":"ROUNDUP(G13/65536,0)","v":2},null,null,{"$f":"J6","v":2},{"$f":"DEC2HEX(M6,4)","v":"0002"},null,"INTM_","INTM_","INTM_","INTM_","INTM_","INTM_"]
[]
["TOF amplitude normalized to 20µm pixel",{"$nulls":3},"Min. dist. resolution (4DCS)\n- normalized to 20µm pixel","cm",{"$f":"G6*100/(C9*8)","v":{"v":0.852272727272727,"d":"0.85"}},null,"Int. time counter","#","µs","Ratio","Dec","Hex",null,"Register address / name"]
{"$rows_left_out":10}
{"sheet":"epc660 frame rate","index":5,"n_rows":15,"n_cols":15,"rows_kept":15,"merged":[[0,0,0,2],[0,4,0,5],[0,7,0,10],[0,12,0,14],[2,8,2,10],[3,4,3,5],[9,4,9,5],[9,8,9,10],[10,12,10,14],[11,0,11,2]]}
["Input Data",{"$nulls":3},"Results",null,null,"Frame rates 12 bit (only)",{"$nulls":4},"Calculations"]
[]
["Parameter","Unit","Value",null,"Parameter (only factory set inputs)","Unit",null,"DCS frame time","Frame rate per integration time",{"$nulls":3},"Parameter (only factory set inputs)","Unit","Value"]
[{"$nulls":4},"Frame rates per integration time",null,null,"[ms]","1 DCS [fps]","2 DCS [fps]","4 DCS [fps]",{"$nulls":3},"12 bit"]
["B&W integration time (exposure time)","µs",10,null,"B&W integration time (exposure time)","µs",null,{"$f":"IF($C$5=0,0,((2*$O$5*$C$11/2/$O$8/$O$9)+$O$6+$O$7+C5)/1000)","v":{"v":6.31583,"d":"6.316"}},{"$f":"IF($C$5=0,\"---\",1000/H5)","v":{"v":158.33231736763,"d":"158.3"}},"---","---",null,"ADC conversion time half row","µs",26.042]
["1. Integration time (exposure time)","µs",{"v":1000,"d":"1,000.0"},null,"1. Integration time (exposure time)","µs",null,{"$f":"((2*$O$5*$C$11/2/$O$8/$O$9)+$O$6+$O$7+C6)/1000","v":{"v":7.30583,"d":"7.306"}},{"$f":"1000/H6","v":{"v":136.876987282759,"d":"136.9"}},{"$f":"I6/2","v":{"v":68.4384936413796,"d":"68.4"}},{"$f":"I6/4","v":{"v":34.2192468206898,"d":"34.2"}},null,"Delay last readout until next exposure","µs",{"v":17,"d":"17.000"}]
["2. integration time (exposure time)","µs",{"v":50,"d":"50.0"},null,"2. integration time (exposure time)","µs",null,{"$f":"((2*$O$5*$C$11/2/$O$8/$O$9)+$O$6+$O$7+C7)/1000","v":{"v":6.35583,"d":"6.356"}},{"$f":"1000/H7","v":{"v":157.335863294015,"d":"157.3"}},{"$f":"I7/2","v":{"v":78.6679316470076,"d":"78.7"}},{"$f":"I7/4","v":{"v":39.3339658235038,"d":"39.3"}},null,"Process time","µs",{"v":38.75,"d":"38.750"}]
["3. Integration time (exposure time)","µs",2.5,null,"3. Integration time (exposure time)","µs",null,{"$f":"((2*$O$5*$C$11/2/$O$8/$O$9)+$O$6+$O$7+C8)/1000","v":{"v":6.30833,"d":"6.308"}},{"$f":"1000/H8","v":{"v":158.520559323942,"d":"158.5"}},{"$f":"I8/2","v":{"v":79.2602796619708,"d":"79.3"}},{"$f":"I8/4","v":{"v":39.6301398309854,"d":"39.6"}},null,"Column reduction effectively","#",{"$f":"IF(C13=2,2,1)","v":1}]
{"$rows_left_out":8}
{"sheet":"epc635 frame rate","index":6,"n_rows":14,"n_cols":21,"rows_kept":14,"merged":[[0,0,0,2],[0,4,0,5],[0,7,0,10],[0,12,0,15],[0,17,0,20],[2,8,2,10],[2,13,2,15],[3,4,3,5],[9,4,9,5],[9,8,9,10],[9,13,9,15],[13,17,14,20]]}
["Input Data",{"$nulls":3},"Results",null,null,"Frame rates 12 bit",{"$nulls":4},"Frame rates 8 bit",{"$nulls":4},"Calculations"]
[]
["Parameter","Unit","Value",null,"Parameter (only factory set inputs)","Unit",null,"DCS frame time","Frame rate per integration time",{"$nulls":3},"DCS frame time","Frame rate per integration time",{"$nulls":3},"Parameter (only factory set inputs)","Unit","Value","Value"]
[{"$nulls":4},"Frame rates per integration time",null,null,"[ms]","1 DCS [fps]","2 DCS [fps]","4 DCS [fps]",null,"[ms]","1 DCS [fps]","2 DCS [fps]","4 DCS [fps]",{"$nulls":3},"12 bit","8 bit"]
["B&W integration time (exposure time)","µs",10,null,"B&W integration time (exposure time)","µs",null,{"$f":"IF($C$5=0,0,((2*$T$5*$T$9/$T$11/$T$12)+$T$6+$T$7+C5)/1000)","v":{"v":1.95625,"d":"1.956"}},{"$f":"IF($C$5=0,\"---\",1000/H5)","v":{"v":511.182108626198,"d":"511.2"}},"---","---",null,{"$f":"IF($C$5=0,0,((2*$U$5*$T$9/$T$11/$T$12)+$U$6+$U$7+C5)/1000)","v":{"v":1.53625,"d":"1.536"}},{"$f":"IF($C$5=0,\"---\",1000/M5)","v":{"v":650.935720097641,"d":"650.9"}},"---","---",null,"ADC conversion time half row","µs",{"v":15.75,"d":"15.750"},{"v":12.25,"d":"12.250"}]
["1. Integration time (exposure time)","µs",{"v":1000,"d":"1000.0"},null,"1. Integration time (exposure time)","µs",null,{"$f":"((2*$T$5*$T$9/$T$11/$T$12)+$T$6+$T$7+C6)/1000","v":{"v":2.94625,"d":"2.946"}},{"$f":"1000/H6","v":{"v":339.414509970301,"d":"339.4"}},{"$f":"I6/2","v":{"v":169.707254985151,"d":"169.7"}},{"$f":"I6/4","v":{"v":84.8536274925753,"d":"84.9"}},null,{"$f":"((2*$U$5*$T$9/$T$11/$T$12)+$U$6+$U$7+C6)/1000","v":{"v":2.52625,"d":"2.526"}},{"$f":"1000/M6","v":{"v":395.843641761504,"d":"395.8"}},{"$f":"N6/2","v":{"v":197.921820880752,"d":"197.9"}},{"$f":"N6/4","v":{"v":98.9609104403761,"d":"99.0"}},null,"Delay last readout until next exposure","µs",{"v":17,"d":"17.000"},{"v":17,"d":"17.000"}]
["2. integration time (exposure time)","µs",{"v":50,"d":"50.0"},null,"2. integration time (exposure time)","µs",null,{"$f":"((2*$T$5*$T$9/$T$11/$T$12)+$T$6+$T$7+C7)/1000","v":{"v":1.99625,"d":"1.996"}},{"$f":"1000/H7","v":{"v":500.93926111459,"d":"500.9"}},{"$f":"I7/2","v":{"v":250.469630557295,"d":"250.5"}},{"$f":"I7/4","v":{"v":125.234815278647,"d":"125.2"}},null,{"$f":"((2*$U$5*$T$9/$T$11/$T$12)+$U$6+$U$7+C7)/1000","v":{"v":1.57625,"d":"1.576"}},{"$f":"1000/M7","v":{"v":634.41712926249,"d":"634.4"}},{"$f":"N7/2","v":{"v":317.208564631245,"d":"317.2"}},{"$f":"N7/4","v":{"v":158.604282315623,"d":"158.6"}},null,"Process time","µs",{"v":39.25,"d":"39.250"},{"v":39.25,"d":"39.250"}]
["3. Integration time (exposure time)","µs",2.5,null,"3. Integration time (exposure time)","µs",null,{"$f":"((2*$T$5*$T$9/$T$11/$T$12)+$T$6+$T$7+C8)/1000","v":{"v":1.94875,"d":"1.949"}},{"$f":"1000/H8","v":{"v":513.149454778704,"d":"513.1"}},{"$f":"I8/2","v":{"v":256.574727389352,"d":"256.6"}},{"$f":"I8/4","v":{"v":128.287363694676,"d":"128.3"}},null,{"$f":"((2*$U$5*$T$9/$T$11/$T$12)+$U$6+$U$7+C8)/1000","v":{"v":1.52875,"d":"1.529"}},{"$f":"1000/M8","v":{"v":654.129190515127,"d":"654.1"}},{"$f":"N8/2","v":{"v":327.064595257563,"d":"327.1"}},{"$f":"N8/4","v":{"v":163.532297628782,"d":"163.5"}},null,"ROI columns (max. 160)","#",160]
{"$rows_left_out":7}
{"sheet":"epc611 frame rate","index":7,"n_rows":55,"n_cols":23,"rows_kept":55,"merged":[[0,0,0,2],[0,4,0,13],[0,15,0,22],[3,5,4,5],[3,6,4,6],[3,8,3,10],[3,11,3,13],[5,4,6,4],[8,4,14,4],[13,0,14,1],[16,4,22,4],[24,4,30,4],[32,4,38,4],[40,4,46,4],[48,4,54,4]]}
["Input Data",{"$nulls":3},"Results",{"$nulls":10},"Calculations"]
[]
[{"$nulls":15},"SPI","Chip","Chip:","Chip:","SPI:","S + C:","Readout","Exp.:"]
["Parameter","Unit","Value",null,null,"Shortcut","Description","DCS frame time","Frame rate [fps]",null,null,"Features",{"$nulls":3},"tSHUTTER","tINIT","tPROC","tCONV_TOT","tLAST_DATA","tPROC_TOT",null,"tINT"]
[{"$nulls":7},"[µs]","1 DCS","2 DCS","4 DCS","Bin","Sum","Int. times",null,"[µs]","[µs]","[µs]","[µs]","[µs]","[µs]","[Bit]","[µs]"]
["B&W integration time (exposure time)","µs",10,null,"B&W","GIM","8x8 pixel grayscale imager",{"$f":"IF($C$6=0,0,U6+W6)","v":{"v":218.75,"d":"218.8"}},{"$f":"IF($C$6=0,\"---\",1/H6*1000*1000)","v":{"v":4571.42857142857,"d":"4,571"}},null,null,"---","---",1,null,{"$f":"$P$9","v":{"v":1,"d":"1.00"}},{"$f":"$Q$9","v":{"v":18,"d":"18.00"}},{"$f":"$R$9","v":38.75},{"$f":"4*2*15.625","v":{"v":125,"d":"125.00"}},{"$f":"(8*1.5*2)+2","v":{"v":26,"d":"26.00"}},{"$f":"SUM(P6:T6)","v":{"v":208.75,"d":"209"}},12,{"$f":"$C$6","v":10}]
["1. Integration time (exposure time)","µs",{"v":1000,"d":"1,000.0"},null,null,"GBI2","2x2 pixel gray., bin., ROI",{"$f":"IF($C$6=0,0,U7+W7)","v":{"v":89.375,"d":"89.4"}},{"$f":"IF($C$6=0,\"---\",1/H7*1000*1000)","v":{"v":11188.8111888112,"d":"11,189"}},null,null,"4 p","---",1,null,{"v":1,"d":"1.00"},{"v":18,"d":"18.00"},38.75,{"$f":"1*15.625","v":{"v":15.625,"d":"15.63"}},{"$f":"(2*2)+2","v":{"v":6,"d":"6.00"}},{"$f":"SUM(P7:T7)","v":{"v":79.375,"d":"79"}},12,{"$f":"$C$6","v":10}]
["2. integration time (exposure time)","µs",{"v":50,"d":"50.0"}]
{"$rows_left_out":48}
{"sheet":"Support Tables","index":8,"n_rows":111,"n_cols":14,"rows_kept":111,"merged":[[0,0,0,13],[2,2,2,5],[2,9,2,13]]}
["Graph calculation"]
[]
[null,null,"Noise sources, max. - min",{"$nulls":3},"Dist noise dark (mm)","Dist noise amb (mm)",null,"Table"]
["Step","Amplitude basic","Digitizing (mm)","Photon shot dark (mm)","Photon shot amb (mm)","Floor (mm)","1 sigma","1 sigma",null,"Amplitude basic","Dist noise dark (mm)","Dist noise incl. ambient (mm)","Min. TOF amplitude","Max. amplitude"]
[{"v":0.001,"d":"0"},{"$f":"A5*20","v":{"v":0.02,"d":"0"}},{"$f":"('Distance noise'!$F$4*1000/4)/(2*B5/'Distance noise'!$F$10)/SQRT(2)","v":{"v":530330.085889911,"d":"530,330.1"}},{"$f":"('Distance noise'!$F$4*1000/4)/(('Distance noise'!$B$7/'Distance noise'!$B$9)*2*(B5/'Distance noise'!$B$6)*'Distance noise'!$F$5)*SQRT(('Distance noise'!$B$7/'Distance noise'!$B$9)*2*(2*B5/'Distance noise'!$B$6)*'Distance noise'!$F$5)/SQRT(2)","v":{"v":2031.38197574538,"d":"2,031.4"}},{"$f":"('Distance noise'!$F$4*1000/4)/(('Distance noise'!$B$7/'Distance noise'!$B$9)*2*(B5/'Distance noise'!$B$6)*'Distance noise'!$F$5)*SQRT(('Distance noise'!$B$7/'Distance noise'!$B$9)*2*((2*B5/'Distance noise'!$B$6)+('Distance noise'!$B$13/'Distance noise'!$B$6*'Distance noise'!$B$8))*'Distance noise'!$F$5)/SQRT(2)","v":{"v":1284760.37418112,"d":"1,284,760.4"}},{"$f":"('Distance noise'!$F$4*1000/4)/(2*'Distance noise'!$B$6)*2*'Distance noise'!$B$11/SQRT(2)","v":{"v":19.430755467388,"d":"19.4"}},{"$f":"SQRT((C5*C5)+(D5*D5)+(F5*F5))/5","v":{"v":106066.795349023,"d":"106,066.8"}},{"$f":"SQRT((C5*C5)+(E5*E5)+(F5*F5))/5","v":{"v":277982.677118094,"d":"277,982.7"}},null,{"$f":"B5","v":{"v":0.02,"d":"0"}},{"$f":"G5","v":{"v":106066.795349023,"d":"106,066.8"}},{"$f":"H5","v":{"v":277982.677118094,"d":"277,982.7"}},{"$f":"IF(('Distance noise'!B13-21)<$J5,\" \",IF(('Distance noise'!$F$26-20)>$J5,\" \",IF(('Distance noise'!$F$26-1)<$J5,0,1000)))","v":" "},{"$f":"IF(('Distance noise'!$B$13-20)>$J5,\" \",IF(('Distance noise'!$B$13)<$J5,0,1000))","v":" "}]
[1,{"$f":"A6*20","v":20},{"$f":"('Distance noise'!$F$4*1000/4)/(2*B6/'Distance noise'!$F$10)/SQRT(2)","v":{"v":530.330085889911,"d":"530.3"}},{"$f":"('Distance noise'!$F$4*1000/4)/(('Distance noise'!$B$7/'Distance noise'!$B$9)*2*(B6/'Distance noise'!$B$6)*'Distance noise'!$F$5)*SQRT(('Distance noise'!$B$7/'Distance noise'!$B$9)*2*(2*B6/'Distance noise'!$B$6)*'Distance noise'!$F$5)/SQRT(2)","v":{"v":64.2379384116831,"d":"64.2"}},{"$f":"('Distance noise'!$F$4*1000/4)/(('Distance noise'!$B$7/'Distance noise'!$B$9)*2*(B6/'Distance noise'!$B$6)*'Distance noise'!$F$5)*SQRT(('Distance noise'!$B$7/'Distance noise'!$B$9)*2*((2*B6/'Distance noise'!$B$6)+('Distance noise'!$B$13/'Distance noise'!$B$6*'Distance noise'!$B$8))*'Distance noise'!$F$5)/SQRT(2)","v":{"v":1286.36371422886,"d":"1,286.4"}},{"$f":"('Distance noise'!$F$4*1000/4)/(2*'Distance noise'!$B$6)*2*'Distance noise'!$B$11/SQRT(2)","v":{"v":19.430755467388,"d":"19.4"}},{"$f":"SQRT((C6*C6)+(D6*D6)+(F6*F6))/5","v":{"v":106.911938901026,"d":"106.9"}},{"$f":"SQRT((C6*C6)+(E6*E6)+(F6*F6))/5","v":{"v":278.30624567499,"d":"278.3"}},null,{"$f":"B6","v":20},{"$f":"G6","v":{"v":106.911938901026,"d":"106.9"}},{"$f":"H6","v":{"v":278.30624567499,"d":"278.3"}},{"$f":"IF(('Distance noise'!$F$29-21)<$J6,\" \",IF(('Distance noise'!$F$26-20)>$J6,\" \",IF(('Distance noise'!$F$26-1)<$J6,0,1000)))","v":" "},{"$f":"IF(('Distance noise'!$B$13-20)>$J6,\" \",IF(('Distance noise'!$B$13-1)<$J6,0,1000))","v":" "}]
[2,{"$f":"A7*20","v":40},{"$f":"('Distance noise'!$F$4*1000/4)/(2*B7/'Distance noise'!$F$10)/SQRT(2)","v":{"v":265.165042944955,"d":"265.2"}},{"$f":"('Distance noise'!$F$4*1000/4)/(('Distance noise'!$B$7/'Distance noise'!$B$9)*2*(B7/'Distance noise'!$B$6)*'Distance noise'!$F$5)*SQRT(('Distance noise'!$B$7/'Distance noise'!$B$9)*2*(2*B7/'Distance noise'!$B$6)*'Distance noise'!$F$5)/SQRT(2)","v":{"v":45.4230818603449,"d":"45.4"}},{"$f":"('Distance noise'!$F$4*1000/4)/(('Distance noise'!$B$7/'Distance noise'!$B$9)*2*(B7/'Distance noise'!$B$6)*'Distance noise'!$F$5)*SQRT(('Distance noise'!$B$7/'Distance noise'!$B$9)*2*((2*B7/'Distance noise'!$B$6)+('Distance noise'!$B$13/'Distance noise'!$B$6*'Distance noise'!$B$8))*'Distance noise'!$F$5)/SQRT(2)","v":{"v":643.983330144508,"d":"644.0"}},{"$f":"('Distance noise'!$F$4*1000/4)/(2*'Distance noise'!$B$6)*2*'Distance noise'!$B$11/SQRT(2)","v":{"v":19.430755467388,"d":"19.4"}},{"$f":"SQRT((C7*C7)+(D7*D7)+(F7*F7))/5","v":{"v":53.9456432434446,"d":"53.9"}},{"$f":"SQRT((C7*C7)+(E7*E7)+(F7*F7))/5","v":{"v":139.34196550387,"d":"139.3"}},null,{"$f":"B7","v":40},{"$f":"G7","v":{"v":53.9456432434446,"d":"53.9"}},{"$f":"H7","v":{"v":139.34196550387,"d":"139.3"}},{"$f":"IF(('Distance noise'!$F$29-21)<$J7,\" \",IF(('Distance noise'!$F$26-20)>$J7,\" \",IF(('Distance noise'!$F$26-1)<$J7,0,1000)))","v":" "},{"$f":"IF(('Distance noise'!$B$13-20)>$J7,\" \",IF(('Distance noise'!$B$13-1)<$J7,0,1000))","v":" "}]
[3,{"$f":"A8*20","v":60},{"$f":"('Distance noise'!$F$4*1000/4)/(2*B8/'Distance noise'!$F$10)/SQRT(2)","v":{"v":176.776695296637,"d":"176.8"}},{"$f":"('Distance noise'!$F$4*1000/4)/(('Distance noise'!$B$7/'Distance noise'!$B$9)*2*(B8/'Distance noise'!$B$6)*'Distance noise'!$F$5)*SQRT(('Distance noise'!$B$7/'Distance noise'!$B$9)*2*(2*B8/'Distance noise'!$B$6)*'Distance noise'!$F$5)/SQRT(2)","v":{"v":37.0877910341718,"d":"37.1"}},{"$f":"('Distance noise'!$F$4*1000/4)/(('Distance noise'!$B$7/'Distance noise'!$B$9)*2*(B8/'Distance noise'!$B$6)*'Distance noise'!$F$5)*SQRT(('Distance noise'!$B$7/'Distance noise'!$B$9)*2*((2*B8/'Distance noise'!$B$6)+('Distance noise'!$B$13/'Distance noise'!$B$6*'Distance noise'!$B$8))*'Distance noise'!$F$5)/SQRT(2)","v":{"v":429.855871290654,"d":"429.9"}},{"$f":"('Distance noise'!$F$4*1000/4)/(2*'Distance noise'!$B$6)*2*'Distance noise'!$B$11/SQRT(2)","v":{"v":19.430755467388,"d":"19.4"}},{"$f":"SQRT((C8*C8)+(D8*D8)+(F8*F8))/5","v":{"v":36.3334878600048,"d":"36.3"}},{"$f":"SQRT((C8*C8)+(E8*E8)+(F8*F8))/5","v":{"v":93.0384059066105,"d":"93.0"}},null,{"$f":"B8","v":60},{"$f":"G8","v":{"v":36.3334878600048,"d":"36.3"}},{"$f":"H8","v":{"v":93.0384059066105,"d":"93.0"}},{"$f":"IF(('Distance noise'!$F$29-21)<$J8,\" \",IF(('Distance noise'!$F$26-20)>$J8,\" \",IF(('Distance noise'!$F$26-1)<$J8,0,1000)))","v":" "},{"$f":"IF(('Distance noise'!$B$13-20)>$J8,\" \",IF(('Distance noise'!$B$13-1)<$J8,0,1000))","v":" "}]
{"$rows_left_out":103}